Reaction Details
TargetCyclin-H/Cyclin-dependent kinase 7
LigandBDBM7533
Substrate/Competitorn/a
Meas. Tech.ChEMBL_790668 (CHEMBL1926121)
IC50 520±n/a nM
Citation Wilson, SCAtrash, BBarlow, CEccles, SFischer, PMHayes, AKelland, LJackson, WJarman, MMirza, AMoreno, JNutley, BPRaynaud, FISheldrake, PWalton, MWestwood, RWhittaker, SWorkman, PMcDonald, E Design, synthesis and biological evaluation of 6-pyridylmethylaminopurines as CDK inhibitors. Bioorg Med Chem19:6949-65 (2011) 
 
Cyclin-H/Cyclin-dependent kinase 7
Name:Cyclin-H/Cyclin-dependent kinase 7
Type:Protein Complex
Mol. Mass.:n/a
Description:n/a
Components:This complex has 2 components.
Component 1
Name:Cyclin-H
Synonyms:CCNH Cyclin H p34 | p37
Type:Enzyme Subunit
Mol. Mass.:37646.05
Organism:Homo sapiens (Human)
Description:n/a
Residue:323
Component 2
Name:Cyclin-dependent kinase 7
Synonyms:39 kDa protein kinase CAK1 CDK-activating kinase 1 (CAK) CDK7_HUMAN Cell division protein kinase 7 Cyclin-dependent kinase 7 (CDK7/cyclin H) P39 Mo15 TFIIH basal transcription factor complex kinase subunit
Type:Enzyme Subunit
Mol. Mass.:39047.01
Organism:Homo sapiens (Human)
Description:n/a
Residue:346
BDBM7533
NameBDBM7533
Synonyms:(2R)-2-[[6-(benzylamino)-9-isopropyl-purin-2-yl]amino]butan-1-ol (2R)-2-[[6-[(phenylmethyl)amino]-9-propan-2-yl-2-purinyl]amino]-1-butanol (2R)-2-{[6-(benzylamino)-9-(propan-2-yl)-9H-purin-2-yl]amino}butan-1-ol 2,6,9-Trisubstituted purine deriv. 28 CYC-202 cid_160355
TypeSmall organic molecule
Emp. Form.C19H26N6O
Mol. Mass.354.4493
SMILESCC[C@H](CO)Nc1nc(NCc2ccccc2)c2ncn(C(C)C)c2n1