Reaction Details
TargetMitogen-activated protein kinase 1
LigandBDBM50358215
Substrate/Competitorn/a
Meas. Tech.ChEMBL_790670 (CHEMBL1926123)
IC50 73000±n/a nM
Citation Wilson, SCAtrash, BBarlow, CEccles, SFischer, PMHayes, AKelland, LJackson, WJarman, MMirza, AMoreno, JNutley, BPRaynaud, FISheldrake, PWalton, MWestwood, RWhittaker, SWorkman, PMcDonald, E Design, synthesis and biological evaluation of 6-pyridylmethylaminopurines as CDK inhibitors. Bioorg Med Chem19:6949-65 (2011) 
 
Mitogen-activated protein kinase 1
Name:Mitogen-activated protein kinase 1
Type:Ser/Thr Protein Kinase
Mol. Mass.:41392.76
Organism:Homo sapiens (Human)
Description:P28482
Residue:360
BDBM50358215
NameBDBM50358215
Synonyms:CHEMBL1922114
TypeSmall organic molecule
Emp. Form.C19H27N7O
Mol. Mass.369.464
SMILESCC[C@@H](Nc1nc(NCc2ccccn2)c2ncn(C(C)C)c2n1)C(C)O