Reaction Details
TargetMitogen-activated protein kinase 1
LigandBDBM50358221
Substrate/Competitorn/a
Meas. Tech.ChEMBL_790670 (CHEMBL1926123)
IC50 37000±n/a nM
Citation Wilson, SCAtrash, BBarlow, CEccles, SFischer, PMHayes, AKelland, LJackson, WJarman, MMirza, AMoreno, JNutley, BPRaynaud, FISheldrake, PWalton, MWestwood, RWhittaker, SWorkman, PMcDonald, E Design, synthesis and biological evaluation of 6-pyridylmethylaminopurines as CDK inhibitors. Bioorg Med Chem19:6949-65 (2011) 
 
Mitogen-activated protein kinase 1
Name:Mitogen-activated protein kinase 1
Type:Ser/Thr Protein Kinase
Mol. Mass.:41392.76
Organism:Homo sapiens (Human)
Description:P28482
Residue:360
BDBM50358221
NameBDBM50358221
Synonyms:CHEMBL1922120 | US8846696, (3RS,4R)-4-{9-Isopropyl-6-[(pyridin-3-ylmethyl)-amino]-9H-purin-2-ylamino}-hexan-3-ol
TypeSmall organic molecule
Emp. Form.C20H29N7O
Mol. Mass.383.4906
SMILESCCC(O)[C@@H](CC)Nc1nc(NCc2cccnc2)c2ncn(C(C)C)c2n1