Reaction Details
TargetMitogen-activated protein kinase 1
LigandBDBM50358242
Substrate/Competitorn/a
Meas. Tech.ChEMBL_790670 (CHEMBL1926123)
IC50 52000±n/a nM
Citation Wilson, SCAtrash, BBarlow, CEccles, SFischer, PMHayes, AKelland, LJackson, WJarman, MMirza, AMoreno, JNutley, BPRaynaud, FISheldrake, PWalton, MWestwood, RWhittaker, SWorkman, PMcDonald, E Design, synthesis and biological evaluation of 6-pyridylmethylaminopurines as CDK inhibitors. Bioorg Med Chem19:6949-65 (2011) 
 
Mitogen-activated protein kinase 1
Name:Mitogen-activated protein kinase 1
Type:Ser/Thr Protein Kinase
Mol. Mass.:41392.76
Organism:Homo sapiens (Human)
Description:P28482
Residue:360
BDBM50358242
NameBDBM50358242
Synonyms:CHEMBL1922217
TypeSmall organic molecule
Emp. Form.C21H30N6O
Mol. Mass.382.5025
SMILESCC[C@H](Nc1nc(NCc2ccccc2)c2ncn(C(C)C)c2n1)C(C)(C)O