Reaction Details
TargetDiacylglycerol O-acyltransferase 1
LigandBDBM50358337
Substrate/Competitorn/a
Meas. Tech.ChEMBL_789309 (CHEMBL1924476)
IC50 253±n/a nM
Citation Yun, WAhmad, MChen, YGillespie, PConde-Knape, KKazmer, SLi, SQian, YTaub, RWertheimer, SJWhittard, TBolin, D Discovery and optimization of 2-phenyloxazole derivatives as diacylglycerol acyltransferase-1 inhibitors. Bioorg Med Chem Lett21:7205-9 (2011) 
 
Diacylglycerol O-acyltransferase 1
Name:Diacylglycerol O-acyltransferase 1
Type:Protein
Mol. Mass.:55297.82
Organism:Homo sapiens (Human)
Description:O75907
Residue:488
BDBM50358337
NameBDBM50358337
Synonyms:CHEMBL1922686
TypeSmall organic molecule
Emp. Form.C20H19F3N4O2
Mol. Mass.404.3857
SMILESCCN(CC)c1ccc(NC(=O)c2nc(oc2C(F)(F)F)-c2ccccc2)cn1