Reaction Details
TargetHistamine H1 receptor
LigandBDBM50079527
Substrate/Competitorn/a
Meas. Tech.ChEMBL_790127 (CHEMBL1926406)
Ki 0.178±n/a nM
Citation de Graaf, CKooistra, AJVischer, HFKatritch, VKuijer, MShiroishi, MIwata, SShimamura, TStevens, RCde Esch, IJLeurs, R Crystal structure-based virtual screening for fragment-like ligands of the human histamine H(1) receptor. J Med Chem54:8195-206 (2011) 
 
Histamine H1 receptor
Name:Histamine H1 receptor
Type:G Protein-Coupled Receptor (GPCR)
Mol. Mass.:55808.72
Organism:Homo sapiens (Human)
Description:Cell pellets from SK-N-MC cells transfected with human H1 receptor were used in binding assay.
Residue:487
BDBM50079527
NameBDBM50079527
Synonyms:(3E)-3-dibenzo[b,e]oxepin-11(6H)-ylidene-N,N-dimethylpropan-1-amine(3Z)-3-dibenzo[b,e]oxepin-11(6H)-ylidene-N,N-dimethylpropan-1-amine DOXEPIN | cis-doxepin
TypeSmall organic molecule
Emp. Form.C19H21NO
Mol. Mass.279.3761
SMILESCN(C)CC\C=C1\c2ccccc2COc2ccccc12