Reaction Details
TargetHistamine H1 receptor
LigandBDBM50419462
Substrate/Competitorn/a
Meas. Tech.ChEMBL_790127 (CHEMBL1926406)
Ki 8128.31±n/a nM
Citation de Graaf, CKooistra, AJVischer, HFKatritch, VKuijer, MShiroishi, MIwata, SShimamura, TStevens, RCde Esch, IJLeurs, R Crystal structure-based virtual screening for fragment-like ligands of the human histamine H(1) receptor. J Med Chem54:8195-206 (2011) 
 
Histamine H1 receptor
Name:Histamine H1 receptor
Type:G Protein-Coupled Receptor (GPCR)
Mol. Mass.:55808.72
Organism:Homo sapiens (Human)
Description:Cell pellets from SK-N-MC cells transfected with human H1 receptor were used in binding assay.
Residue:487
BDBM50419462
NameBDBM50419462
Synonyms:CHEMBL1923534
TypeSmall organic molecule
Emp. Form.C16H22N4S
Mol. Mass.302.438
SMILESNCCSc1nc(C2CCCCC2)n(n1)-c1ccccc1