Reaction Details
TargetHistamine H1 receptor
LigandBDBM50419463
Substrate/Competitorn/a
Meas. Tech.ChEMBL_790127 (CHEMBL1926406)
Ki 10715.19±n/a nM
Citation de Graaf, CKooistra, AJVischer, HFKatritch, VKuijer, MShiroishi, MIwata, SShimamura, TStevens, RCde Esch, IJLeurs, R Crystal structure-based virtual screening for fragment-like ligands of the human histamine H(1) receptor. J Med Chem54:8195-206 (2011) 
 
Histamine H1 receptor
Name:Histamine H1 receptor
Type:G Protein-Coupled Receptor (GPCR)
Mol. Mass.:55808.72
Organism:Homo sapiens (Human)
Description:Cell pellets from SK-N-MC cells transfected with human H1 receptor were used in binding assay.
Residue:487
BDBM50419463
NameBDBM50419463
Synonyms:CHEMBL1617548
TypeSmall organic molecule
Emp. Form.C18H17N3O
Mol. Mass.291.3471
SMILESC=CCn1c2ccccc2n(CC(=O)c2ccccc2)c1=N