Reaction Details
TargetInhibitor of nuclear factor kappa-B kinase subunit beta
LigandBDBM50358584
Substrate/Competitorn/a
Meas. Tech.ChEMBL_789248 (CHEMBL1924373)
IC50 44±n/a nM
Citation Watterson, SHLangevine, CMVan Kirk, KKempson, JGuo, JSpergel, SHDas, JMoquin, RVDyckman, AJNirschl, DGregor, KPattoli, MAYang, XMcIntyre, KWYang, GGalella, MABooth-Lute, HChen, LYang, ZWang-Iverson, DMcKinnon, MDodd, JHBarrish, JCBurke, JRPitts, WJ Novel tricyclic inhibitors of IKK2: discovery and SAR leading to the identification of 2-methoxy-N-((6-(1-methyl-4-(methylamino)-1,6-dihydroimidazo[4,5-d]pyrrolo[2,3-b]pyridin-7-yl)pyridin-2-yl)methyl)acetamide (BMS-066). Bioorg Med Chem Lett21:7006-12 (2011) 
 
Inhibitor of nuclear factor kappa-B kinase subunit beta
Name:Inhibitor of nuclear factor kappa-B kinase subunit beta
Type:Serine/threonine-protein kinase
Mol. Mass.:86554.39
Organism:Homo sapiens (Human)
Description:GST-tagged IKK-2 was expressed in High Five cells and purified.
Residue:756
BDBM50358584
NameBDBM50358584
Synonyms:CHEMBL1923976
TypeSmall organic molecule
Emp. Form.C19H21N7O
Mol. Mass.363.4163
SMILESCCC(=O)NCc1cccc(n1)-c1cc2c(nc(NC)c3ncn(C)c23)[nH]1