Reaction Details
TargetInhibitor of nuclear factor kappa-B kinase subunit beta
LigandBDBM50334633
Substrate/Competitorn/a
Meas. Tech.ChEMBL_789248 (CHEMBL1924373)
IC50 19±n/a nM
Citation Watterson, SHLangevine, CMVan Kirk, KKempson, JGuo, JSpergel, SHDas, JMoquin, RVDyckman, AJNirschl, DGregor, KPattoli, MAYang, XMcIntyre, KWYang, GGalella, MABooth-Lute, HChen, LYang, ZWang-Iverson, DMcKinnon, MDodd, JHBarrish, JCBurke, JRPitts, WJ Novel tricyclic inhibitors of IKK2: discovery and SAR leading to the identification of 2-methoxy-N-((6-(1-methyl-4-(methylamino)-1,6-dihydroimidazo[4,5-d]pyrrolo[2,3-b]pyridin-7-yl)pyridin-2-yl)methyl)acetamide (BMS-066). Bioorg Med Chem Lett21:7006-12 (2011) 
 
Inhibitor of nuclear factor kappa-B kinase subunit beta
Name:Inhibitor of nuclear factor kappa-B kinase subunit beta
Type:Serine/threonine-protein kinase
Mol. Mass.:86554.39
Organism:Homo sapiens (Human)
Description:GST-tagged IKK-2 was expressed in High Five cells and purified.
Residue:756
BDBM50334633
NameBDBM50334633
Synonyms:(S)-N-(1-(3-(5-(ethylamino)-8-methyl-8H-imidazo[4,5-d]thiazolo[5,4-b]pyridin-2-yl)phenyl)ethyl)acetamide | CHEMBL1642546
TypeSmall organic molecule
Emp. Form.C20H22N6OS
Mol. Mass.394.493
SMILESCCNc1nc2sc(nc2c2n(C)cnc12)-c1cccc(c1)[C@H](C)NC(C)=O