Reaction Details
TargetInhibitor of nuclear factor kappa-B kinase subunit beta
LigandBDBM50334634
Substrate/Competitorn/a
Meas. Tech.ChEMBL_789248 (CHEMBL1924373)
IC50 13±n/a nM
Citation Watterson, SHLangevine, CMVan Kirk, KKempson, JGuo, JSpergel, SHDas, JMoquin, RVDyckman, AJNirschl, DGregor, KPattoli, MAYang, XMcIntyre, KWYang, GGalella, MABooth-Lute, HChen, LYang, ZWang-Iverson, DMcKinnon, MDodd, JHBarrish, JCBurke, JRPitts, WJ Novel tricyclic inhibitors of IKK2: discovery and SAR leading to the identification of 2-methoxy-N-((6-(1-methyl-4-(methylamino)-1,6-dihydroimidazo[4,5-d]pyrrolo[2,3-b]pyridin-7-yl)pyridin-2-yl)methyl)acetamide (BMS-066). Bioorg Med Chem Lett21:7006-12 (2011) 
 
Inhibitor of nuclear factor kappa-B kinase subunit beta
Name:Inhibitor of nuclear factor kappa-B kinase subunit beta
Type:Serine/threonine-protein kinase
Mol. Mass.:86554.39
Organism:Homo sapiens (Human)
Description:GST-tagged IKK-2 was expressed in High Five cells and purified.
Residue:756
BDBM50334634
NameBDBM50334634
Synonyms:(S)-N-(1-(3-(5-amino-8-methyl-8H-imidazo[4,5-d]thiazolo[5,4-b]pyridin-2-yl)phenyl)ethyl)acetamide | CHEMBL1642547
TypeSmall organic molecule
Emp. Form.C18H18N6OS
Mol. Mass.366.44
SMILESC[C@H](NC(C)=O)c1cccc(c1)-c1nc2c(nc(N)c3ncn(C)c23)s1