Reaction Details
TargetProtein-tyrosine kinase 6
LigandBDBM50358591
Substrate/Competitorn/a
Meas. Tech.ChEMBL_789271 (CHEMBL1924438)
IC50 310±n/a nM
Citation Watterson, SHLangevine, CMVan Kirk, KKempson, JGuo, JSpergel, SHDas, JMoquin, RVDyckman, AJNirschl, DGregor, KPattoli, MAYang, XMcIntyre, KWYang, GGalella, MABooth-Lute, HChen, LYang, ZWang-Iverson, DMcKinnon, MDodd, JHBarrish, JCBurke, JRPitts, WJ Novel tricyclic inhibitors of IKK2: discovery and SAR leading to the identification of 2-methoxy-N-((6-(1-methyl-4-(methylamino)-1,6-dihydroimidazo[4,5-d]pyrrolo[2,3-b]pyridin-7-yl)pyridin-2-yl)methyl)acetamide (BMS-066). Bioorg Med Chem Lett21:7006-12 (2011) 
 
Protein-tyrosine kinase 6
Name:Protein-tyrosine kinase 6
Type:Tyrosine-protein kinase
Mol. Mass.:51839.11
Organism:Homo sapiens (Human)
Description:n/a
Residue:451
BDBM50358591
NameBDBM50358591
Synonyms:CHEMBL1923983
TypeSmall organic molecule
Emp. Form.C19H21N7O2
Mol. Mass.379.4157
SMILESCNc1nc2[nH]c(cc2c2n(C)cnc12)-c1cccc(CNC(=O)COC)n1