Reaction Details
TargetProto-oncogene tyrosine-protein kinase receptor Ret
LigandBDBM50358591
Substrate/Competitorn/a
Meas. Tech.ChEMBL_789273 (CHEMBL1924440)
IC50 614±n/a nM
Citation Watterson, SHLangevine, CMVan Kirk, KKempson, JGuo, JSpergel, SHDas, JMoquin, RVDyckman, AJNirschl, DGregor, KPattoli, MAYang, XMcIntyre, KWYang, GGalella, MABooth-Lute, HChen, LYang, ZWang-Iverson, DMcKinnon, MDodd, JHBarrish, JCBurke, JRPitts, WJ Novel tricyclic inhibitors of IKK2: discovery and SAR leading to the identification of 2-methoxy-N-((6-(1-methyl-4-(methylamino)-1,6-dihydroimidazo[4,5-d]pyrrolo[2,3-b]pyridin-7-yl)pyridin-2-yl)methyl)acetamide (BMS-066). Bioorg Med Chem Lett21:7006-12 (2011) 
 
Proto-oncogene tyrosine-protein kinase receptor Ret
Name:Proto-oncogene tyrosine-protein kinase receptor Ret
Type:Protein
Mol. Mass.:124318.29
Organism:Homo sapiens (Human)
Description:P07949
Residue:1114
BDBM50358591
NameBDBM50358591
Synonyms:CHEMBL1923983
TypeSmall organic molecule
Emp. Form.C19H21N7O2
Mol. Mass.379.4157
SMILESCNc1nc2[nH]c(cc2c2n(C)cnc12)-c1cccc(CNC(=O)COC)n1