Reaction Details
TargetTyrosine-protein kinase ABL1
LigandBDBM50358832
Substrate/Competitorn/a
Meas. Tech.ChEMBL_790403 (CHEMBL1925856)
IC50 1100±n/a nM
Citation Lü, SLuo, QHao, XLi, XJi, LZheng, WWang, F Synthesis and docking study of 2-phenylaminopyrimidine Abl tyrosine kinase inhibitors. Bioorg Med Chem Lett21:6964-8 (2011) 
 
Tyrosine-protein kinase ABL1
Name:Tyrosine-protein kinase ABL1
Type:Enzyme
Mol. Mass.:122897.30
Organism:Homo sapiens (Human)
Description:P00519
Residue:1130
BDBM50358832
NameBDBM50358832
Synonyms:CHEMBL1923082
TypeSmall organic molecule
Emp. Form.C24H21N5OS
Mol. Mass.427.521
SMILESCSc1cccc(c1)C(=O)Nc1ccc(C)c(Nc2nccc(n2)-c2cccnc2)c1