Reaction Details
TargetC-C chemokine receptor type 5
LigandBDBM50359461
Substrate/Competitorn/a
Meas. Tech.ChEMBL_792600 (CHEMBL1930241)
IC50 0.98±n/a nM
Citation Skerlj, RBridger, GZhou, YBourque, EMcEachern, ELangille, JHarwig, CVeale, DYang, WLi, TZhu, YBey, MBaird, ISartori, MMetz, MMosi, RNelson, KBodart, VWong, RFricker, SMac Farland, RHuskens, DSchols, D Design and synthesis of pyridin-2-ylmethylaminopiperidin-1-ylbutyl amide CCR5 antagonists that are potent inhibitors of M-tropic (R5) HIV-1 replication. Bioorg Med Chem Lett21:6950-4 (2011) 
 
C-C chemokine receptor type 5
Name:C-C chemokine receptor type 5
Type:Enzyme
Mol. Mass.:40540.21
Organism:Homo sapiens (Human)
Description:P51681
Residue:352
BDBM50359461
NameBDBM50359461
Synonyms:CHEMBL1926904
TypeSmall organic molecule
Emp. Form.C33H41N7O3
Mol. Mass.583.7237
SMILESC[C@H](CCNC(=O)c1c(C)cc(nc1C)C#N)N1CCC(CC1)N(Cc1cnccc1C)c1ccc(OCC(N)=O)cc1