Reaction Details
TargetAndrogen receptor
LigandBDBM50360434
Substrate/Competitorn/a
Meas. Tech.ChEMBL_796602 (CHEMBL1937917)
EC50>10000±n/a nM
Citation Yamamoto, SMatsunaga, NHitaka, TYamada, MHara, TMiyazaki, JSantou, TKusaka, MYamaoka, MKanzaki, NFuruya, STasaka, AHamamura, KIto, M Design, synthesis, and biological evaluation of 4-phenylpyrrole derivatives as novel androgen receptor antagonists. Bioorg Med Chem20:422-34 (2011) 
 
Androgen receptor
Name:Androgen receptor
Type:Receptor
Mol. Mass.:99185.27
Organism:Homo sapiens (Human)
Description:CHO cells were stably transfected with human AR gene.
Residue:920
BDBM50360434
NameBDBM50360434
Synonyms:CHEMBL1934434
TypeSmall organic molecule
Emp. Form.C21H20N2O4
Mol. Mass.364.3945
SMILESCOC(=O)c1c(C)n(Cc2ccccc2)c(C)c1-c1ccc(cc1)[N+]([O-])=O