Reaction Details
TargetAndrogen receptor
LigandBDBM50360443
Substrate/Competitorn/a
Meas. Tech.ChEMBL_796524 (CHEMBL1937839)
IC50 3.4±n/a nM
Citation Yamamoto, SMatsunaga, NHitaka, TYamada, MHara, TMiyazaki, JSantou, TKusaka, MYamaoka, MKanzaki, NFuruya, STasaka, AHamamura, KIto, M Design, synthesis, and biological evaluation of 4-phenylpyrrole derivatives as novel androgen receptor antagonists. Bioorg Med Chem20:422-34 (2011) 
 
Androgen receptor
Name:Androgen receptor
Type:Receptor
Mol. Mass.:99185.27
Organism:Homo sapiens (Human)
Description:CHO cells were stably transfected with human AR gene.
Residue:920
BDBM50360443
NameBDBM50360443
Synonyms:CHEMBL1934443
TypeSmall organic molecule
Emp. Form.C20H16N4
Mol. Mass.312.3678
SMILESCc1c(C#N)c(c(C)n1Cc1cccnc1)-c1ccc(cc1)C#N