Reaction Details
TargetTyrosine-protein kinase
LigandBDBM50360606
Substrate/Competitorn/a
Meas. Tech.ChEMBL_795546 (CHEMBL1935924)
IC50 1810±n/a nM
Citation Powell, NAKohrt, JTFilipski, KJKaufman, MSheehan, DEdmunds, JEDelaney, AWang, YBourbonais, FLee, DYSchwende, FSun, FMcConnell, PCatana, CChen, HOhren, JPerrin, LA Novel and selective spiroindoline-based inhibitors of Sky kinase. Bioorg Med Chem Lett22:190-3 (2011) 
 
Tyrosine-protein kinase
Name:Tyrosine-protein kinase
Synonyms:Syk protein
Type:PROTEIN
Mol. Mass.:71353.61
Organism:Mus musculus
Description:ChEMBL_795546
Residue:629
BDBM50360606
NameBDBM50360606
Synonyms:CHEMBL1933539
TypeSmall organic molecule
Emp. Form.C23H23FN4O
Mol. Mass.390.4533
SMILESFc1ccc2[nH]c(cc2c1)C(=O)N1C[C@]2(CCN(C2)C2CNC2)c2ccccc12