Reaction Details
TargetTyrosine-protein kinase Lck
LigandBDBM50360611
Substrate/Competitorn/a
Meas. Tech.ChEMBL_795646 (CHEMBL1936076)
IC50>30000±n/a nM
Citation Powell, NAKohrt, JTFilipski, KJKaufman, MSheehan, DEdmunds, JEDelaney, AWang, YBourbonais, FLee, DYSchwende, FSun, FMcConnell, PCatana, CChen, HOhren, JPerrin, LA Novel and selective spiroindoline-based inhibitors of Sky kinase. Bioorg Med Chem Lett22:190-3 (2011) 
 
Tyrosine-protein kinase Lck
Name:Tyrosine-protein kinase Lck
Type:n/a
Mol. Mass.:57987.83
Organism:Homo sapiens (Human)
Description:P06239
Residue:509
BDBM50360611
NameBDBM50360611
Synonyms:CHEMBL1933550
TypeSmall organic molecule
Emp. Form.C24H25FN4O
Mol. Mass.404.4799
SMILESFc1ccc2cc([nH]c2c1)C(=O)N1C[C@]2(CCN(C2)C2CCNC2)c2ccccc12