Reaction Details
TargetTyrosine-protein kinase receptor UFO
LigandBDBM50360611
Substrate/Competitorn/a
Meas. Tech.ChEMBL_795657 (CHEMBL1936138)
IC50 5250±n/a nM
Citation Powell, NAKohrt, JTFilipski, KJKaufman, MSheehan, DEdmunds, JEDelaney, AWang, YBourbonais, FLee, DYSchwende, FSun, FMcConnell, PCatana, CChen, HOhren, JPerrin, LA Novel and selective spiroindoline-based inhibitors of Sky kinase. Bioorg Med Chem Lett22:190-3 (2011) 
 
Tyrosine-protein kinase receptor UFO
Name:Tyrosine-protein kinase receptor UFO
Type:Enzyme
Mol. Mass.:98316.97
Organism:Homo sapiens (Human)
Description:P30530
Residue:894
BDBM50360611
NameBDBM50360611
Synonyms:CHEMBL1933550
TypeSmall organic molecule
Emp. Form.C24H25FN4O
Mol. Mass.404.4799
SMILESFc1ccc2cc([nH]c2c1)C(=O)N1C[C@]2(CCN(C2)C2CCNC2)c2ccccc12