Reaction Details
TargetTyrosine-protein kinase
LigandBDBM50360617
Substrate/Competitorn/a
Meas. Tech.ChEMBL_795546 (CHEMBL1935924)
IC50 843±n/a nM
Citation Powell, NAKohrt, JTFilipski, KJKaufman, MSheehan, DEdmunds, JEDelaney, AWang, YBourbonais, FLee, DYSchwende, FSun, FMcConnell, PCatana, CChen, HOhren, JPerrin, LA Novel and selective spiroindoline-based inhibitors of Sky kinase. Bioorg Med Chem Lett22:190-3 (2011) 
 
Tyrosine-protein kinase
Name:Tyrosine-protein kinase
Synonyms:Syk protein
Type:PROTEIN
Mol. Mass.:71353.61
Organism:Mus musculus
Description:ChEMBL_795546
Residue:629
BDBM50360617
NameBDBM50360617
Synonyms:CHEMBL1933546
TypeSmall organic molecule
Emp. Form.C25H28N4O2
Mol. Mass.416.5154
SMILESCOc1ccc2cc([nH]c2c1)C(=O)N1C[C@]2(CCN(C2)C2CCNC2)c2ccccc12