Reaction Details
TargetSerine/threonine-protein kinase pim-2
LigandBDBM50360609
Substrate/Competitorn/a
Meas. Tech.ChEMBL_795650 (CHEMBL1936080)
IC50>30000±n/a nM
Citation Powell, NAKohrt, JTFilipski, KJKaufman, MSheehan, DEdmunds, JEDelaney, AWang, YBourbonais, FLee, DYSchwende, FSun, FMcConnell, PCatana, CChen, HOhren, JPerrin, LA Novel and selective spiroindoline-based inhibitors of Sky kinase. Bioorg Med Chem Lett22:190-3 (2011) 
 
Serine/threonine-protein kinase pim-2
Name:Serine/threonine-protein kinase pim-2
Type:Serine/threonine-protein kinase
Mol. Mass.:34185.93
Organism:Homo sapiens (Human)
Description:Q9P1W9
Residue:311
BDBM50360609
NameBDBM50360609
Synonyms:CHEMBL1933551
TypeSmall organic molecule
Emp. Form.C26H30N4O
Mol. Mass.414.5426
SMILESC[C@@H]1CCC(CN1)N1CC[C@@]2(C1)CN(C(=O)c1cc3ccccc3[nH]1)c1ccccc21