Reaction Details
TargetProto-oncogene tyrosine-protein kinase Src
LigandBDBM50360609
Substrate/Competitorn/a
Meas. Tech.ChEMBL_795652 (CHEMBL1936082)
IC50>30000±n/a nM
Citation Powell, NAKohrt, JTFilipski, KJKaufman, MSheehan, DEdmunds, JEDelaney, AWang, YBourbonais, FLee, DYSchwende, FSun, FMcConnell, PCatana, CChen, HOhren, JPerrin, LA Novel and selective spiroindoline-based inhibitors of Sky kinase. Bioorg Med Chem Lett22:190-3 (2011) 
 
Proto-oncogene tyrosine-protein kinase Src
Name:Proto-oncogene tyrosine-protein kinase Src
Type:Protein
Mol. Mass.:59838.60
Organism:Homo sapiens (Human)
Description:P12931
Residue:536
BDBM50360609
NameBDBM50360609
Synonyms:CHEMBL1933551
TypeSmall organic molecule
Emp. Form.C26H30N4O
Mol. Mass.414.5426
SMILESC[C@@H]1CCC(CN1)N1CC[C@@]2(C1)CN(C(=O)c1cc3ccccc3[nH]1)c1ccccc21