Reaction Details
TargetMitogen-activated protein kinase 1
LigandBDBM50360610
Substrate/Competitorn/a
Meas. Tech.ChEMBL_795562 (CHEMBL1935940)
IC50>30000±n/a nM
Citation Powell, NAKohrt, JTFilipski, KJKaufman, MSheehan, DEdmunds, JEDelaney, AWang, YBourbonais, FLee, DYSchwende, FSun, FMcConnell, PCatana, CChen, HOhren, JPerrin, LA Novel and selective spiroindoline-based inhibitors of Sky kinase. Bioorg Med Chem Lett22:190-3 (2011) 
 
Mitogen-activated protein kinase 1
Name:Mitogen-activated protein kinase 1
Type:Ser/Thr Protein Kinase
Mol. Mass.:41392.76
Organism:Homo sapiens (Human)
Description:P28482
Residue:360
BDBM50360610
NameBDBM50360610
Synonyms:CHEMBL1933552
TypeSmall organic molecule
Emp. Form.C26H29FN4O
Mol. Mass.432.5331
SMILESC[C@@H]1CCC(CN1)N1CC[C@@]2(C1)CN(C(=O)c1cc3ccc(F)cc3[nH]1)c1ccccc21