Reaction Details
TargetPeroxisome proliferator-activated receptor alpha
LigandBDBM50360740
Substrate/Competitorn/a
Meas. Tech.ChEMBL_796444 (CHEMBL1937759)
EC50 190±n/a nM
Citation Nomura, MYumoto, KShinozaki, TIsogai, STakano, YMurakami, K Discovery of cyclic amine-substituted benzoic acids as PPARa agonists. Bioorg Med Chem Lett22:334-8 (2011) 
 
Peroxisome proliferator-activated receptor alpha
Name:Peroxisome proliferator-activated receptor alpha
Type:PROTEIN
Mol. Mass.:52119.89
Organism:Canis familiaris
Description:ChEMBL_796444
Residue:468
BDBM50360740
NameBDBM50360740
Synonyms:CHEMBL1934476
TypeSmall organic molecule
Emp. Form.C23H22ClN3O3S
Mol. Mass.455.957
SMILESCc1nc(sc1C(=O)N[C@H]1CCCN(C1)c1cccc(c1)C(O)=O)-c1ccc(Cl)cc1