Reaction Details
TargetPeroxisome proliferator-activated receptor gamma
LigandBDBM50360740
Substrate/Competitorn/a
Meas. Tech.ChEMBL_796445 (CHEMBL1937760)
EC50 11000±n/a nM
Citation Nomura, MYumoto, KShinozaki, TIsogai, STakano, YMurakami, K Discovery of cyclic amine-substituted benzoic acids as PPARa agonists. Bioorg Med Chem Lett22:334-8 (2011) 
 
Peroxisome proliferator-activated receptor gamma
Name:Peroxisome proliferator-activated receptor gamma
Type:PROTEIN
Mol. Mass.:57504.30
Organism:Canis familiaris
Description:ChEMBL_796445
Residue:505
BDBM50360740
NameBDBM50360740
Synonyms:CHEMBL1934476
TypeSmall organic molecule
Emp. Form.C23H22ClN3O3S
Mol. Mass.455.957
SMILESCc1nc(sc1C(=O)N[C@H]1CCCN(C1)c1cccc(c1)C(O)=O)-c1ccc(Cl)cc1