Reaction Details
TargetPotassium voltage-gated channel subfamily H member 2
LigandBDBM50360994
Substrate/Competitorn/a
Meas. Tech.ChEMBL_796233 (CHEMBL1938198)
Ki 2600±n/a nM
Citation Ravula, SBYu, JTran, JAArellano, MTucci, FCMoree, WJLi, BFPetroski, REWen, JMalany, SHoare, SRMadan, ACrowe, PDBeaton, G Lead optimization of 2-(piperidin-3-yl)-1H-benzimidazoles: identification of 2-morpholin- and 2-thiomorpholin-2-yl-1H-benzimidazoles as selective and CNS penetrating H¿?-antihistamines for insomnia. Bioorg Med Chem Lett22:421-6 (2011) 
 
Potassium voltage-gated channel subfamily H member 2
Name:Potassium voltage-gated channel subfamily H member 2
Type:Multi-pass membrane protein
Mol. Mass.:126672.65
Organism:Homo sapiens (Human)
Description:Q12809
Residue:1159
BDBM50360994
NameBDBM50360994
Synonyms:CHEMBL1935431
TypeSmall organic molecule
Emp. Form.C23H27FN4O
Mol. Mass.394.4851
SMILESCN(C)C(=O)CN1CCCC(C1)c1nc2ccccc2n1Cc1ccc(F)cc1