Reaction Details
TargetHistamine H1 receptor
LigandBDBM50361001
Substrate/Competitorn/a
Meas. Tech.ChEMBL_796225 (CHEMBL1938190)
Ki 1±n/a nM
Citation Ravula, SBYu, JTran, JAArellano, MTucci, FCMoree, WJLi, BFPetroski, REWen, JMalany, SHoare, SRMadan, ACrowe, PDBeaton, G Lead optimization of 2-(piperidin-3-yl)-1H-benzimidazoles: identification of 2-morpholin- and 2-thiomorpholin-2-yl-1H-benzimidazoles as selective and CNS penetrating H¿?-antihistamines for insomnia. Bioorg Med Chem Lett22:421-6 (2011) 
 
Histamine H1 receptor
Name:Histamine H1 receptor
Type:G Protein-Coupled Receptor (GPCR)
Mol. Mass.:55808.72
Organism:Homo sapiens (Human)
Description:Cell pellets from SK-N-MC cells transfected with human H1 receptor were used in binding assay.
Residue:487
BDBM50361001
NameBDBM50361001
Synonyms:CHEMBL1935438
TypeSmall organic molecule
Emp. Form.C20H23N3O
Mol. Mass.321.4161
SMILESC(Cn1c(nc2ccccc12)C1CCCNC1)Oc1ccccc1