Reaction Details
TargetHistamine H4 receptor
LigandBDBM50257496
Substrate/Competitorn/a
Meas. Tech.ChEMBL_795785 (CHEMBL1936672)
Ki 328±n/a nM
Citation Smits, RALim, HDvan der Meer, TKuhne, SBessembinder, KZuiderveld, OPWijtmans, Mde Esch, IJLeurs, R Ligand based design of novel histamine H4 receptor antagonists; fragment optimization and analysis of binding kinetics. Bioorg Med Chem Lett22:461-7 (2011) 
 
Histamine H4 receptor
Name:Histamine H4 receptor
Type:G Protein-Coupled Receptor (GPCR)
Mol. Mass.:44517.02
Organism:Homo sapiens (Human)
Description:Binding assays were using CHO cells stably expressing hH4R receptors.
Residue:390
BDBM50257496
NameBDBM50257496
Synonyms:4-(4-methylpiperazin-1-yl)quinazoline | CHEMBL506969
TypeSmall organic molecule
Emp. Form.C13H16N4
Mol. Mass.228.2929
SMILESCN1CCN(CC1)c1ncnc2ccccc12