Reaction Details
TargetHistamine H3 receptor
LigandBDBM50361011
Substrate/Competitorn/a
Meas. Tech.ChEMBL_795791 (CHEMBL1936678)
Ki 98±n/a nM
Citation Smits, RALim, HDvan der Meer, TKuhne, SBessembinder, KZuiderveld, OPWijtmans, Mde Esch, IJLeurs, R Ligand based design of novel histamine H4 receptor antagonists; fragment optimization and analysis of binding kinetics. Bioorg Med Chem Lett22:461-7 (2011) 
 
Histamine H3 receptor
Name:Histamine H3 receptor
Type:G Protein-Coupled Receptor (GPCR)
Mol. Mass.:48691.47
Organism:Homo sapiens (Human)
Description:Binding assays were using CHO cells stably expressing hH3R receptors.
Residue:445
BDBM50361011
NameBDBM50361011
Synonyms:CHEMBL1935573
TypeSmall organic molecule
Emp. Form.C17H19N5O
Mol. Mass.309.3657
SMILESCN1CCN(CC1)c1nc(N)nc2cc(ccc12)-c1ccco1