Reaction Details
TargetHistamine H1 receptor
LigandBDBM50361011
Substrate/Competitorn/a
Meas. Tech.ChEMBL_795792 (CHEMBL1936679)
Ki 6422±n/a nM
Citation Smits, RALim, HDvan der Meer, TKuhne, SBessembinder, KZuiderveld, OPWijtmans, Mde Esch, IJLeurs, R Ligand based design of novel histamine H4 receptor antagonists; fragment optimization and analysis of binding kinetics. Bioorg Med Chem Lett22:461-7 (2011) 
 
Histamine H1 receptor
Name:Histamine H1 receptor
Type:G Protein-Coupled Receptor (GPCR)
Mol. Mass.:55808.72
Organism:Homo sapiens (Human)
Description:Cell pellets from SK-N-MC cells transfected with human H1 receptor were used in binding assay.
Residue:487
BDBM50361011
NameBDBM50361011
Synonyms:CHEMBL1935573
TypeSmall organic molecule
Emp. Form.C17H19N5O
Mol. Mass.309.3657
SMILESCN1CCN(CC1)c1nc(N)nc2cc(ccc12)-c1ccco1