Reaction Details
TargetRibosomal protein S6 kinase alpha-3
LigandBDBM50361839
Substrate/Competitorn/a
Meas. Tech.ChEMBL_799760 (CHEMBL1941466)
IC50 840±n/a nM
Citation Boyer, SJBurke, JGuo, XKirrane, TMSnow, RJZhang, YSarko, CSoleymanzadeh, LSwinamer, AWestbrook, JDicapua, FPadyana, ACogan, DGao, AXiong, ZMadwed, JBKashem, MKugler, SO'Neill, MM Indole RSK inhibitors. Part 1: discovery and initial SAR. Bioorg Med Chem Lett22:733-7 (2011) 
 
Ribosomal protein S6 kinase alpha-3
Name:Ribosomal protein S6 kinase alpha-3
Type:Serine/threonine-protein kinase
Mol. Mass.:83740.03
Organism:Homo sapiens (Human)
Description:The human RSK2 sequence differed from the Genbank entry NM_004586 at one residue, V45G. The protein was cloned and purified from baculovirus expression system.
Residue:740
BDBM50361839
NameBDBM50361839
Synonyms:CHEMBL1938776
TypeSmall organic molecule
Emp. Form.C19H18N4O2
Mol. Mass.334.3718
SMILESC[C@@H]1NC(=O)c2cc3ccc(cc3n2[C@@H]1C)C(=O)Nc1cccnc1