Reaction Details
TargetRibosomal protein S6 kinase alpha-3
LigandBDBM50361843
Substrate/Competitorn/a
Meas. Tech.ChEMBL_799761 (CHEMBL1941467)
IC50 220±n/a nM
Citation Boyer, SJBurke, JGuo, XKirrane, TMSnow, RJZhang, YSarko, CSoleymanzadeh, LSwinamer, AWestbrook, JDicapua, FPadyana, ACogan, DGao, AXiong, ZMadwed, JBKashem, MKugler, SO'Neill, MM Indole RSK inhibitors. Part 1: discovery and initial SAR. Bioorg Med Chem Lett22:733-7 (2011) 
 
Ribosomal protein S6 kinase alpha-3
Name:Ribosomal protein S6 kinase alpha-3
Type:Serine/threonine-protein kinase
Mol. Mass.:83740.03
Organism:Homo sapiens (Human)
Description:The human RSK2 sequence differed from the Genbank entry NM_004586 at one residue, V45G. The protein was cloned and purified from baculovirus expression system.
Residue:740
BDBM50361843
NameBDBM50361843
Synonyms:CHEMBL1938788 | US9150577, 154
TypeSmall organic molecule
Emp. Form.C18H16N4O2
Mol. Mass.320.3452
SMILESO=C(Nc1ccccn1)c1ccc2cc3C(=O)NCCCn3c2c1