Reaction Details
TargetRibosomal protein S6 kinase alpha-3
LigandBDBM50361867
Substrate/Competitorn/a
Meas. Tech.ChEMBL_799761 (CHEMBL1941467)
IC50 52±n/a nM
Citation Boyer, SJBurke, JGuo, XKirrane, TMSnow, RJZhang, YSarko, CSoleymanzadeh, LSwinamer, AWestbrook, JDicapua, FPadyana, ACogan, DGao, AXiong, ZMadwed, JBKashem, MKugler, SO'Neill, MM Indole RSK inhibitors. Part 1: discovery and initial SAR. Bioorg Med Chem Lett22:733-7 (2011) 
 
Ribosomal protein S6 kinase alpha-3
Name:Ribosomal protein S6 kinase alpha-3
Type:Serine/threonine-protein kinase
Mol. Mass.:83740.03
Organism:Homo sapiens (Human)
Description:The human RSK2 sequence differed from the Genbank entry NM_004586 at one residue, V45G. The protein was cloned and purified from baculovirus expression system.
Residue:740
BDBM50361867
NameBDBM50361867
Synonyms:CHEMBL1938791 | US9150577, 226
TypeSmall organic molecule
Emp. Form.C22H19N5O2
Mol. Mass.385.4186
SMILESO=C(Nc1cccc(c1)-c1c[nH]cn1)c1ccc2cc3C(=O)NCCCn3c2c1