Reaction Details
TargetSphingosine 1-phosphate receptor 3
LigandBDBM50361882
Substrate/Competitorn/a
Meas. Tech.ChEMBL_799841 (CHEMBL1941547)
EC50>25000±n/a nM
Citation Frohn, MCee, VJLanman, BAPickrell, AJGolden, JRivenzon-Segal, DMiddleton, SFiorino, MXu, HSchrag, MXu, YMcElvain, MMuller, KSiu, JBürli, R Novel 5- and 6-subtituted benzothiazoles with improved physicochemical properties: potent S1P¿? agonists with in vivo lymphocyte-depleting activity. Bioorg Med Chem Lett22:628-33 (2011) 
 
Sphingosine 1-phosphate receptor 3
Name:Sphingosine 1-phosphate receptor 3
Type:G Protein-Coupled Receptor (GPCR)
Mol. Mass.:42278.13
Organism:Homo sapiens (Human)
Description:Q99500
Residue:378
BDBM50361882
NameBDBM50361882
Synonyms:CHEMBL1938928
TypeSmall organic molecule
Emp. Form.C24H18FN3O3S
Mol. Mass.447.481
SMILESOC(=O)C1CN(Cc2ccc(-c3nc4ccc(cc4s3)C(=O)c3ccccn3)c(F)c2)C1