Reaction Details
TargetSphingosine 1-phosphate receptor 1
LigandBDBM50361877
Substrate/Competitorn/a
Meas. Tech.ChEMBL_799839 (CHEMBL1941545)
EC50 2370±n/a nM
Citation Frohn, MCee, VJLanman, BAPickrell, AJGolden, JRivenzon-Segal, DMiddleton, SFiorino, MXu, HSchrag, MXu, YMcElvain, MMuller, KSiu, JBürli, R Novel 5- and 6-subtituted benzothiazoles with improved physicochemical properties: potent S1P¿? agonists with in vivo lymphocyte-depleting activity. Bioorg Med Chem Lett22:628-33 (2011) 
 
Sphingosine 1-phosphate receptor 1
Name:Sphingosine 1-phosphate receptor 1
Type:Enzyme
Mol. Mass.:42836.02
Organism:Homo sapiens (Human)
Description:P21453
Residue:382
BDBM50361877
NameBDBM50361877
Synonyms:CHEMBL1938923
TypeSmall organic molecule
Emp. Form.C25H22FN3O2S
Mol. Mass.447.524
SMILESCC(c1ccc2sc(nc2c1)-c1ccc(CN2CC(C2)C(O)=O)cc1F)c1ccccn1