Reaction Details
TargetSphingosine 1-phosphate receptor 1
LigandBDBM50361880
Substrate/Competitorn/a
Meas. Tech.ChEMBL_799839 (CHEMBL1941545)
EC50 240±n/a nM
Citation Frohn, MCee, VJLanman, BAPickrell, AJGolden, JRivenzon-Segal, DMiddleton, SFiorino, MXu, HSchrag, MXu, YMcElvain, MMuller, KSiu, JBürli, R Novel 5- and 6-subtituted benzothiazoles with improved physicochemical properties: potent S1P¿? agonists with in vivo lymphocyte-depleting activity. Bioorg Med Chem Lett22:628-33 (2011) 
 
Sphingosine 1-phosphate receptor 1
Name:Sphingosine 1-phosphate receptor 1
Type:Enzyme
Mol. Mass.:42836.02
Organism:Homo sapiens (Human)
Description:P21453
Residue:382
BDBM50361880
NameBDBM50361880
Synonyms:CHEMBL1938926
TypeSmall organic molecule
Emp. Form.C26H22FN3O2S
Mol. Mass.459.535
SMILESOC(=O)C1CN(Cc2ccc(-c3nc4ccc(cc4s3)C3(CC3)c3ccccn3)c(F)c2)C1