Reaction Details
TargetAromatase
LigandBDBM23926
Substrate/Competitorn/a
Meas. Tech.ChEMBL_799539 (CHEMBL1941245)
IC50 25000±n/a nM
Citation Mayhoub, ASMarler, LKondratyuk, TPPark, EJPezzuto, JMCushman, M Optimizing thiadiazole analogues of resveratrol versus three chemopreventive targets. Bioorg Med Chem20:510-20 (2011) 
 
Aromatase
Name:Aromatase
Type:Enzyme
Mol. Mass.:57888.92
Organism:Homo sapiens (Human)
Description:P11511
Residue:503
BDBM23926
NameBDBM23926
Synonyms:(E)-resveratrol CHEMBL165 Stilbene, 2f cid_445154 trans-resveratrol
TypeSmall organic molecule
Emp. Form.C14H12O3
Mol. Mass.228.2433
SMILESOc1ccc(\C=C\c2cc(O)cc(O)c2)cc1