Reaction Details
TargetMatrix metalloproteinase-19
LigandBDBM50362092
Substrate/Competitorn/a
Meas. Tech.ChEMBL_797393 (CHEMBL1943056)
IC50>10000±n/a nM
Citation De Savi, CMorley, ADNash, IKaroutchi, GPage, KTing, AGerhardt, S Lead optimisation of selective non-zinc binding inhibitors of MMP13. Part 2. Bioorg Med Chem Lett22:271-7 (2011) 
 
Matrix metalloproteinase-19
Name:Matrix metalloproteinase-19
Type:PROTEIN
Mol. Mass.:57362.84
Organism:Homo sapiens (Human)
Description:ChEMBL_797393
Residue:508
BDBM50362092
NameBDBM50362092
Synonyms:CHEMBL1940308
TypeSmall organic molecule
Emp. Form.C28H33N3O3
Mol. Mass.459.5799
SMILESCN1CCC(CC1)NC(=O)c1ccc(Oc2ccc(cc2)C#C[C@]2(O)CN3CCC2CC3)cc1