Reaction Details
TargetHeat shock protein HSP 90-alpha
LigandBDBM50362231
Substrate/Competitorn/a
Meas. Tech.ChEMBL_798461 (CHEMBL1944310)
Kd 1.3±n/a nM
Citation Suda, AKoyano, HHayase, THada, KKawasaki, KKomiyama, SHasegawa, KFukami, TASato, SMiura, TOno, NYamazaki, TSaitoh, RShimma, NShiratori, YTsukuda, T Design and synthesis of novel macrocyclic 2-amino-6-arylpyrimidine Hsp90 inhibitors. Bioorg Med Chem Lett22:1136-41 (2012) 
 
Heat shock protein HSP 90-alpha
Name:Heat shock protein HSP 90-alpha
Type:Molecular Chaperone
Mol. Mass.:84623.45
Organism:Homo sapiens (Human)
Description:P07900
Residue:732
BDBM50362231
NameBDBM50362231
Synonyms:CHEMBL1939374
TypeSmall organic molecule
Emp. Form.C22H22N4O2S
Mol. Mass.406.501
SMILESCc1cc(C)c2cc1-c1cc(Sc3cccc(OCCCNC2=O)c3)nc(N)n1