Reaction Details
TargetCorticotropin-releasing factor receptor 1
LigandBDBM50362263
Substrate/Competitorn/a
Meas. Tech.ChEMBL_798647 (CHEMBL1942636)
IC50 13.4±n/a nM
Citation Saito, TObitsu, TKohno, HSugimoto, IMatsushita, TNishiyama, THirota, TTakeda, HMatsumura, NUeno, SKishi, AKagamiishi, YNakai, HTakaoka, Y Pyrrolo[1,2-b]pyridazines, pyrrolo[2,1-f]triazin-4(3H)-ones, and related compounds as novel corticotropin-releasing factor 1 (CRF¿?) receptor antagonists. Bioorg Med Chem20:1122-38 (2012) 
 
Corticotropin-releasing factor receptor 1
Name:Corticotropin-releasing factor receptor 1
Type:Enzyme
Mol. Mass.:50744.31
Organism:Homo sapiens (Human)
Description:P34998
Residue:444
BDBM50362263
NameBDBM50362263
Synonyms:CHEMBL1939574
TypeSmall organic molecule
Emp. Form.C24H32N2O
Mol. Mass.364.5237
SMILESCCOc1ccc(c(CC)c1)-c1nn2c(C)cc(C(CC)CC)c2cc1C