Reaction Details
TargetCorticotropin-releasing factor receptor 1
LigandBDBM50362266
Substrate/Competitorn/a
Meas. Tech.ChEMBL_798647 (CHEMBL1942636)
IC50 7.4±n/a nM
Citation Saito, TObitsu, TKohno, HSugimoto, IMatsushita, TNishiyama, THirota, TTakeda, HMatsumura, NUeno, SKishi, AKagamiishi, YNakai, HTakaoka, Y Pyrrolo[1,2-b]pyridazines, pyrrolo[2,1-f]triazin-4(3H)-ones, and related compounds as novel corticotropin-releasing factor 1 (CRF¿?) receptor antagonists. Bioorg Med Chem20:1122-38 (2012) 
 
Corticotropin-releasing factor receptor 1
Name:Corticotropin-releasing factor receptor 1
Type:Enzyme
Mol. Mass.:50744.31
Organism:Homo sapiens (Human)
Description:P34998
Residue:444
BDBM50362266
NameBDBM50362266
Synonyms:CHEMBL1939577
TypeSmall organic molecule
Emp. Form.C22H30N4
Mol. Mass.350.5004
SMILESCCC(CC)c1cc(C)n2nc(c(C)cc12)-c1cnc(cc1C)N(C)C