Reaction Details
TargetNeuropeptides B/W receptor type 1
LigandBDBM50362409
Substrate/Competitorn/a
Meas. Tech.ChEMBL_797951 (CHEMBL1942828)
IC50 3.9±n/a nM
Citation Anthony Romero, FHastings, NBMoningka, RGuo, ZWang, MDi Salvo, JLei, YTrusca, DDeng, QTong, VTerebetski, JLBall, RGUjjainwalla, F The discovery of potent antagonists of NPBWR1 (GPR7). Bioorg Med Chem Lett22:1014-8 (2012) 
 
Neuropeptides B/W receptor type 1
Name:Neuropeptides B/W receptor type 1
Type:PROTEIN
Mol. Mass.:36085.77
Organism:Mus musculus
Description:ChEMBL_797950
Residue:329
BDBM50362409
NameBDBM50362409
Synonyms:CHEMBL1940543
TypeSmall organic molecule
Emp. Form.C34H40N4O3S
Mol. Mass.584.771
SMILESCOc1ccc(cc1)C1(CCC1)N[C@@H]1CC[C@@H]([C@H](C1)c1ccsc1)C(=O)N1CCN(CC1)c1nc2cc(C)ccc2o1