Reaction Details
TargetNeuropeptides B/W receptor type 1
LigandBDBM50362410
Substrate/Competitorn/a
Meas. Tech.ChEMBL_797950 (CHEMBL1942827)
IC50 2.6±n/a nM
Citation Anthony Romero, FHastings, NBMoningka, RGuo, ZWang, MDi Salvo, JLei, YTrusca, DDeng, QTong, VTerebetski, JLBall, RGUjjainwalla, F The discovery of potent antagonists of NPBWR1 (GPR7). Bioorg Med Chem Lett22:1014-8 (2012) 
 
Neuropeptides B/W receptor type 1
Name:Neuropeptides B/W receptor type 1
Type:PROTEIN
Mol. Mass.:36085.77
Organism:Mus musculus
Description:ChEMBL_797950
Residue:329
BDBM50362410
NameBDBM50362410
Synonyms:CHEMBL1940542
TypeSmall organic molecule
Emp. Form.C28H34BrN5O2S2
Mol. Mass.616.636
SMILESCOc1ccc(cc1)C1(CCC1)N[C@@H]1CC[C@@H]([C@H](C1)c1ccsc1)C(=O)N1CCN(CC1)c1nnc(Br)s1