Reaction Details
TargetAldo-keto reductase family 1 member B10
LigandBDBM50362842
Substrate/Competitorn/a
Meas. Tech.ChEMBL_798534 (CHEMBL1942331)
IC50 16±n/a nM
Citation Soda, MHu, DEndo, STakemura, MLi, JWada, RIfuku, SZhao, HTEl-Kabbani, OOhta, SYamamura, KToyooka, NHara, AMatsunaga, T Design, synthesis and evaluation of caffeic acid phenethyl ester-based inhibitors targeting a selectivity pocket in the active site of human aldo-keto reductase 1B10. Eur J Med Chem48:321-9 (2012) 
 
Aldo-keto reductase family 1 member B10
Name:Aldo-keto reductase family 1 member B10
Type:Protein
Mol. Mass.:36024.67
Organism:Homo sapiens (Human)
Description:O60218. 1ZUA; 4JII; 4GQ0
Residue:316
BDBM50362842
NameBDBM50362842
Synonyms:CHEMBL1940398
TypeSmall organic molecule
Emp. Form.C19H20O4
Mol. Mass.312.3597
SMILESCOc1cc(O)ccc1\C=C\C(=O)OCCCc1ccccc1