Reaction Details
TargetAldo-keto reductase family 1 member B10
LigandBDBM50362838
Substrate/Competitorn/a
Meas. Tech.ChEMBL_798534 (CHEMBL1942331)
IC50 240±n/a nM
Citation Soda, MHu, DEndo, STakemura, MLi, JWada, RIfuku, SZhao, HTEl-Kabbani, OOhta, SYamamura, KToyooka, NHara, AMatsunaga, T Design, synthesis and evaluation of caffeic acid phenethyl ester-based inhibitors targeting a selectivity pocket in the active site of human aldo-keto reductase 1B10. Eur J Med Chem48:321-9 (2012) 
 
Aldo-keto reductase family 1 member B10
Name:Aldo-keto reductase family 1 member B10
Type:Protein
Mol. Mass.:36024.67
Organism:Homo sapiens (Human)
Description:O60218. 1ZUA; 4JII; 4GQ0
Residue:316
BDBM50362838
NameBDBM50362838
Synonyms:CHEMBL249448
TypeSmall organic molecule
Emp. Form.C25H24O12
Mol. Mass.516.4509
SMILESO[C@@H]1C[C@](O)(C[C@@H](OC(=O)\C=C\c2ccc(O)c(O)c2)[C@@H]1OC(=O)\C=C\c1ccc(O)c(O)c1)C(O)=O