Reaction Details
TargetAldo-keto reductase family 1 member B10
LigandBDBM50362849
Substrate/Competitorn/a
Meas. Tech.ChEMBL_798534 (CHEMBL1942331)
IC50 920±n/a nM
Citation Soda, MHu, DEndo, STakemura, MLi, JWada, RIfuku, SZhao, HTEl-Kabbani, OOhta, SYamamura, KToyooka, NHara, AMatsunaga, T Design, synthesis and evaluation of caffeic acid phenethyl ester-based inhibitors targeting a selectivity pocket in the active site of human aldo-keto reductase 1B10. Eur J Med Chem48:321-9 (2012) 
 
Aldo-keto reductase family 1 member B10
Name:Aldo-keto reductase family 1 member B10
Type:Protein
Mol. Mass.:36024.67
Organism:Homo sapiens (Human)
Description:O60218. 1ZUA; 4JII; 4GQ0
Residue:316
BDBM50362849
NameBDBM50362849
Synonyms:CHEMBL1940391
TypeSmall organic molecule
Emp. Form.C12H14O3
Mol. Mass.206.2378
SMILESCC(C)OC(=O)\C=C\c1ccc(O)cc1