Reaction Details
TargetAldo-keto reductase family 1 member B1
LigandBDBM4374
Substrate/Competitorn/a
Meas. Tech.ChEMBL_798533 (CHEMBL1942330)
IC50 76000±n/a nM
Citation Soda, MHu, DEndo, STakemura, MLi, JWada, RIfuku, SZhao, HTEl-Kabbani, OOhta, SYamamura, KToyooka, NHara, AMatsunaga, T Design, synthesis and evaluation of caffeic acid phenethyl ester-based inhibitors targeting a selectivity pocket in the active site of human aldo-keto reductase 1B10. Eur J Med Chem48:321-9 (2012) 
 
Aldo-keto reductase family 1 member B1
Name:Aldo-keto reductase family 1 member B1
Type:Protein
Mol. Mass.:35855.50
Organism:Homo sapiens (Human)
Description:P15121. 4LAU; 2IKI; 4LB4; 2FZD; 2FZ8; 1US0
Residue:316
BDBM4374
NameBDBM4374
Synonyms:(2E)-3-(4-hydroxyphenyl)prop-2-enoic acid CHEMBL66879 p-Hydroxycinnamic acid (p-HCA) p-hydroxycinnamic acid (M4)
TypeSmall organic molecule
Emp. Form.C9H8O3
Mol. Mass.164.158
SMILESOC(=O)\C=C\c1ccc(O)cc1