Reaction Details
TargetAldo-keto reductase family 1 member B1
LigandBDBM50362836
Substrate/Competitorn/a
Meas. Tech.ChEMBL_798533 (CHEMBL1942330)
IC50 23000±n/a nM
Citation Soda, MHu, DEndo, STakemura, MLi, JWada, RIfuku, SZhao, HTEl-Kabbani, OOhta, SYamamura, KToyooka, NHara, AMatsunaga, T Design, synthesis and evaluation of caffeic acid phenethyl ester-based inhibitors targeting a selectivity pocket in the active site of human aldo-keto reductase 1B10. Eur J Med Chem48:321-9 (2012) 
 
Aldo-keto reductase family 1 member B1
Name:Aldo-keto reductase family 1 member B1
Type:Protein
Mol. Mass.:35855.50
Organism:Homo sapiens (Human)
Description:P15121. 4LAU; 2IKI; 4LB4; 2FZD; 2FZ8; 1US0
Residue:316
BDBM50362836
NameBDBM50362836
Synonyms:ARTEPILLIN
TypeSmall organic molecule
Emp. Form.C19H24O3
Mol. Mass.300.3921
SMILES[#6]\[#6](-[#6])=[#6]/[#6]-c1cc(\[#6]=[#6]\[#6](-[#8])=O)cc(-[#6]\[#6]=[#6](\[#6])-[#6])c1-[#8]