Reaction Details
TargetNitric oxide synthase, inducible
LigandBDBM50363265
Substrate/Competitorn/a
Meas. Tech.ChEMBL_800845 (CHEMBL1948397)
IC50 13±n/a nM
Citation Durón, SGLindstrom, ABonnefous, CZhang, HChen, XSymons, KTSablad, MRozenkrants, NZhang, YWang, LYazdani, NShiau, AKNoble, SARix, PRao, TSHassig, CASmith, ND Heteroaromatic-aminomethyl quinolones: potent and selective iNOS inhibitors. Bioorg Med Chem Lett22:1237-41 (2012) 
 
Nitric oxide synthase, inducible
Name:Nitric oxide synthase, inducible
Type:Homodimer
Mol. Mass.:131141.95
Organism:Homo sapiens (Human)
Description:P35228
Residue:1153
BDBM50363265
NameBDBM50363265
Synonyms:CHEMBL1944720
TypeSmall organic molecule
Emp. Form.C21H16F2N4O
Mol. Mass.378.3747
SMILESFc1ccc2c(CN(Cc3ccccc3)c3cnccn3)cc(=O)[nH]c2c1F